ACTRIS Vocabulary
type: ConceptScheme

absorption tube
type: Concept
definition: Device sampling an airborne component by leading an air sample through a specially designed tube, where the component to be sampled is bound by uptake into the tube walls.
broader: sorbent sampler
in scheme: ACTRIS Vocabulary
creator: https://orcid.org/0000-0002-3380-3470
contributor: https://orcid.org/0000-0002-2908-1970

sorbent sampler
type: Concept
narrower: absorption tube