quality control outcome
type: Concept
narrower: 9 - Missing data

9 - Missing data
type: Concept
definition: Used as place holder when data are missing.
broader: quality control outcome
alternative label: Missing data
in scheme: ACTRIS Vocabulary

ACTRIS Vocabulary
type: ConceptScheme