ACTRIS Vocabulary
type: ConceptScheme

to direction
type: Concept
broader: variable property of interest
definition: Direction into which a vector is pointing. The direction is a bearing in the usual geographical sense, measured positive clockwise from due north.
in scheme: ACTRIS Vocabulary

variable property of interest
type: Concept
narrower: to direction