ACTRIS Vocabulary
type: ConceptScheme

target uncertainties
type: Concept
creator: https://orcid.org/0000-0002-3380-3470
broader: technical requirements
definition: Calculated allowable deviation from a reference standard. May include maximum on the calculated uncertainty of the instrument.
in scheme: ACTRIS Vocabulary

technical requirements
type: Concept
narrower: target uncertainties