ACTRIS Vocabulary
type: ConceptScheme

standard temperature and pressure
type: Concept
creator: https://orcid.org/0000-0002-3380-3470
broader: variable constraints
definition: Measurement stated with respect to standard temperature, 0 deg C, and standard pressure, 1013.25 hPa.
in scheme: ACTRIS Vocabulary

variable constraints
type: Concept
narrower: standard temperature and pressure