ACTRIS Vocabulary
type: ConceptScheme

primary standard
type: Concept
creator: https://orcid.org/0000-0002-3380-3470
broader: quality control reference type
definition: Measurement reference certified against a primary standard.
in scheme: ACTRIS Vocabulary

quality control reference type
type: Concept
narrower: primary standard