ACTRIS Vocabulary
type: ConceptScheme

performance characteristics
type: Concept
creator: https://orcid.org/0000-0002-3380-3470
broader: technical requirements
definition: A set of instrument responses put under test to determine the instruments ability to measure accurately and reliably.
in scheme: ACTRIS Vocabulary

technical requirements
type: Concept
narrower: performance characteristics