ACTRIS Vocabulary
type: ConceptScheme

instrument status check
type: Concept
narrower: offset angle check

offset angle check
type: Concept
contributor: https://orcid.org/0000-0001-5722-3430
creator: https://orcid.org/0000-0001-8301-1319
is replaced by: offsetanglecheck
deprecated: true
broader: instrument status check
definition: Check the zero angle of the calibrator (for polarization channels)
in scheme: ACTRIS Vocabulary