ACTRIS Vocabulary
type: ConceptScheme

number size distribution
type: Concept
creator: https://orcid.org/0000-0002-3380-3470
broader: variable property of interest
definition: The number size distribution is the number concentration of particles as a function of particle diameter. For aerosol, a coordinate variable with the standard name of electrical_mobility_particle_diameter, aerodynamic_particle_diameter, or optical_particle_diameter should be specified to indicate that the property applies at specific particle sizes selected by the indicated method.
in scheme: ACTRIS Vocabulary

variable property of interest
type: Concept
narrower: number size distribution