ACTRIS Vocabulary
type: ConceptScheme

number concentration
type: Concept
creator: https://orcid.org/0000-0002-3380-3470
broader: variable property of interest
definition: Number concentration means number of molecules or particles per unit volume.
in scheme: ACTRIS Vocabulary

variable property of interest
type: Concept
narrower: number concentration