ACTRIS Vocabulary
type: ConceptScheme

boundary check
type: Concept
narrower: negative values check

negative values check
type: Concept
contributor: https://orcid.org/0000-0003-4157-0838
creator: https://orcid.org/0000-0001-8301-1319
is replaced by: negativevaluescheck
deprecated: true
broader: boundary check
definition: This control checks for negative peaks. It performs a profile scanning and checks that the aerosol optical properties are positive within 3σ, that there are not negative peaks and that very extreme values are present only in cirrus cloud cases.
in scheme: ACTRIS Vocabulary