ACTRIS Vocabulary
type: ConceptScheme

naturally negatively charged
type: Concept
creator: https://orcid.org/0000-0002-3380-3470
broader: variable constraints
definition: Refers to particles with a negative charge in their natural state.
in scheme: ACTRIS Vocabulary

variable constraints
type: Concept
narrower: naturally negatively charged