ACTRIS Vocabulary
type: ConceptScheme

ion chromatograph
type: Concept
narrower: ion chromatograph, online

ion chromatograph, online
type: Concept
contributor: https://orcid.org/0000-0003-2042-9333
creator: https://orcid.org/0000-0002-3380-3470
broader: ion chromatograph
definition: Ion chromatograph deployed in the field to receive its sample directly from ambient air through an inlet.
in scheme: ACTRIS Vocabulary