ACTRIS Vocabulary
type: ConceptScheme

instrument calibration
type: Concept
narrower: instrument calibration, off-site

instrument calibration, off-site
type: Concept
creator: https://orcid.org/0000-0002-3380-3470
broader: instrument calibration
definition: The instrument is transported to a calibration facility for calibration.
in scheme: ACTRIS Vocabulary