ACTRIS Vocabulary
type: ConceptScheme

height
type: Concept
creator: https://orcid.org/0000-0002-3380-3470
broader: variable property of interest
definition: Height is the vertical distance above the surface.
in scheme: ACTRIS Vocabulary

variable property of interest
type: Concept
narrower: height