ACTRIS Vocabulary
type: ConceptScheme

gas phase
type: Concept
creator: https://orcid.org/0000-0002-3380-3470
broader: variable matrix
definition: Molecules are sufficiently far apart to overcome attractive forces and to fill all available space almost uniformly.
in scheme: ACTRIS Vocabulary

variable matrix
type: Concept
narrower: gas phase