ACTRIS vocabulary
type: ConceptScheme

gas and particle phase
type: Concept
creator: https://orcid.org/0000-0002-8981-0805
broader: variable matrix
definition: Comprised of gas and liquid or solid aerosol particles.
in scheme: ACTRIS vocabulary

variable matrix
type: Concept
narrower: gas and particle phase