ACTRIS Vocabulary
type: ConceptScheme

gas and PM1
type: Concept
creator: https://orcid.org/0000-0002-3380-3470
broader: gas and particle phase
definition: Phase of molecules sufficiently far apart to overcome attractive forces and to fill all available space almost uniformly, together with fraction of suspended aerosol particle phase with aerodynamic diameters smaller than 1 µm.
in scheme: ACTRIS Vocabulary

gas and particle phase
type: Concept
narrower: gas and PM1