ACTRIS Vocabulary
type: ConceptScheme

from direction
type: Concept
creator: https://orcid.org/0000-0002-3380-3470
broader: variable property of interest
definition: Direction from which a vector is coming, i.e. opposite pointing direction. The direction is a bearing in the usual geographical sense, measured positive clockwise from due north.
in scheme: ACTRIS Vocabulary

variable property of interest
type: Concept
narrower: from direction