ACTRIS Vocabulary
type: ConceptScheme

data quality control measure type
type: Concept
narrower: freeze check

freeze check
type: Concept
creator: https://orcid.org/0000-0002-3380-3470
broader: data quality control measure type
definition: Too many consecutive observations have had the same value (threshold based).
in scheme: ACTRIS Vocabulary