ACTRIS Vocabulary
type: ConceptScheme

column profile
type: Concept
creator: https://orcid.org/0000-0002-3380-3470
broader: variable geometry
definition: Variable is reported as a function of length over a column of a sample.
in scheme: ACTRIS Vocabulary

variable geometry
type: Concept
narrower: column profile