ACTRIS Vocabulary
type: ConceptScheme

boundary check
type: Concept
narrower: check on lidar ratio

check on lidar ratio
type: Concept
contributor: https://orcid.org/0000-0003-4157-0838
creator: https://orcid.org/0000-0001-8301-1319
is replaced by: checkonlidarratio
deprecated: true
broader: boundary check
definition: This control performs a check on the Lidar Ratio values when Extinction and Backscatter are provided in the same product file (i.e. are provided at the same vertical resolution). Lidarratio is defined as positive value and values are typically between 10 and 120 sr.
in scheme: ACTRIS Vocabulary