ACTRIS Vocabulary
type: ConceptScheme

boundary check
type: Concept
narrower: check on Integrated Backscatter

check on Integrated Backscatter
type: Concept
contributor: https://orcid.org/0000-0003-4157-0838
creator: https://orcid.org/0000-0001-8301-1319
is replaced by: checkonIntegratedBackscatter
deprecated: true
broader: boundary check
definition: The aerosol integrated backscatter IB (without any assumption in the lowest troposphere, so evaluated only in the portion of atmosphere covered by the provided profile) should remain under an established threshold for data not belonging to the cirrus category.
in scheme: ACTRIS Vocabulary