ACTRIS Vocabulary
type: ConceptScheme

check if processed by CARS approved lidar configuration
type: Concept
creator: https://orcid.org/0000-0001-8301-1319
is replaced by: checkifprocessedbyCARSapprovedlidarconfiguration
deprecated: true
broader: station audit
definition: Only data products obtained using the approved configuration into the Single Calculus Chain (i.e. Operational product) can be fully quality controlled products. Experimental products are still useful and interesting products btu the data users should be aware that they are not fully quality controlled in the workflow from preforming measurements till the optical data product provision.
in scheme: ACTRIS Vocabulary

station audit
type: Concept
narrower: check if processed by CARS approved lidar configuration