ACTRIS Vocabulary
type: ConceptScheme

beta attenuation particle mass meter
type: Concept
creator: https://orcid.org/0000-0002-3380-3470
broader: radiation absorption detector
definition: Instrument designed for measuring the particle mass concentration by registering the relative absorption of beta radiation by a filter while the filter is being loaded with particle sample.
in scheme: ACTRIS Vocabulary

radiation absorption detector
type: Concept
narrower: beta attenuation particle mass meter