ACTRIS Vocabulary
type: ConceptScheme

ACTRIS compliant
type: Concept
creator: https://orcid.org/0000-0002-3380-3470
broader: compliance
definition: Data are collected in accordance with ACTRIS procedures and comply with the requirements for this variable. The facility component has not necessarily undergone the full ACTRIS labelling process nor is necessarily conducted at an ACTRIS National Facility.
in scheme: ACTRIS Vocabulary

compliance
type: Concept
narrower: ACTRIS compliant