ACTRIS Vocabulary
type: ConceptScheme

3 - Questionable/suspect
type: Concept
alternative label: Questionable/suspect
broader: quality control outcome
definition: Failed non-critical documented metric or subjective test(s).
in scheme: ACTRIS Vocabulary

quality control outcome
type: Concept
narrower: 3 - Questionable/suspect